{"text_format":"1","workbook":"xlsx","n_sheets":7,"sheets":["Setting Parameters","Selection Result","AS Series Catalogue","Language","ProductLanguage","機種清單","Language Mapping"],"not_rendered":{"charts":0,"images":59,"macros":1,"external_links":3,"defined_names":42,"comments":0,"pivot_tables":0},"unopened":[],"bounds":{"document_bytes":16777216,"sheet_cells":100000,"rows_first":2000,"rows_last":500,"rows_between":2000,"halvings":0,"cell_chars":16384,"cell_head_chars":4096},"cells_cut":0,"cells_raw":0,"read":"whole","date_system":"1900"}

{"sheet":"Setting Parameters","index":0,"n_rows":65,"n_cols":26,"rows_kept":65,"cut":false,"hidden":false,"merged":[[186,3,186,11],[187,3,187,11],[188,3,188,11],[189,3,189,11],[190,3,190,11],[181,3,181,11],[182,3,182,11],[183,3,183,11],[184,3,184,11],[185,3,185,11],[196,3,196,11],[197,3,197,11],[198,3,198,11],[199,3,199,11],[191,3,191,11],[192,3,192,11],[193,3,193,11],[194,3,194,11],[195,3,195,11],[179,3,179,11],[180,3,180,11],[171,3,171,11],[172,3,172,11],[173,3,173,11],[174,3,174,11],[175,3,175,11],[166,3,166,11],[167,3,167,11],[168,3,168,11],[169,3,169,11],[170,3,170,11],[176,3,176,11],[177,3,177,11],[178,3,178,11],[161,3,161,11],[162,3,162,11],[163,3,163,11],[164,3,164,11],[165,3,165,11],[156,3,156,11],[157,3,157,11],[158,3,158,11],[159,3,159,11],[160,3,160,11],[151,3,151,11],[152,3,152,11],[153,3,153,11],[154,3,154,11],[155,3,155,11],[146,3,146,11],[147,3,147,11],[148,3,148,11],[149,3,149,11],[150,3,150,11],[141,3,141,11],[142,3,142,11],[143,3,143,11],[144,3,144,11],[145,3,145,11],[136,3,136,11],[137,3,137,11],[138,3,138,11],[139,3,139,11],[140,3,140,11],[131,3,131,11],[132,3,132,11],[133,3,133,11],[134,3,134,11],[135,3,135,11],[126,3,126,11],[127,3,127,11],[128,3,128,11],[129,3,129,11],[130,3,130,11],[121,3,121,11],[122,3,122,11],[123,3,123,11],[124,3,124,11],[125,3,125,11],[116,3,116,11],[117,3,117,11],[118,3,118,11],[119,3,119,11],[120,3,120,11],[111,3,111,11],[112,3,112,11],[113,3,113,11],[114,3,114,11],[115,3,115,11],[106,3,106,11],[107,3,107,11],[108,3,108,11],[109,3,109,11],[110,3,110,11],[101,3,101,11],[102,3,102,11],[103,3,103,11],[104,3,104,11],[105,3,105,11],[96,3,96,11],[97,3,97,11],[98,3,98,11],[99,3,99,11],[100,3,100,11],[91,3,91,11],[92,3,92,11],[93,3,93,11],[94,3,94,11],[95,3,95,11],[86,3,86,11],[87,3,87,11],[88,3,88,11],[89,3,89,11],[90,3,90,11],[81,3,81,11],[82,3,82,11],[83,3,83,11],[84,3,84,11],[85,3,85,11],[76,3,76,11],[77,3,77,11],[78,3,78,11],[79,3,79,11],[80,3,80,11],[71,3,71,11],[72,3,72,11],[73,3,73,11],[74,3,74,11],[75,3,75,11],[66,3,66,11],[67,3,67,11],[68,3,68,11],[69,3,69,11],[70,3,70,11],[61,3,61,11],[62,3,62,11],[63,3,63,11],[64,3,64,11],[65,3,65,11],[56,3,56,11],[57,3,57,11],[58,3,58,11],[59,3,59,11],[60,3,60,11],[0,0,0,8],[0,9,0,10],[13,3,13,11],[14,3,14,11],[6,3,6,11],[45,3,45,11],[46,3,46,11],[22,3,22,11],[23,3,23,11],[24,3,24,11],[25,3,25,11],[26,3,26,11],[27,3,27,11],[28,3,28,11],[29,3,29,11],[30,3,30,11],[31,3,31,11],[32,3,32,11],[33,3,33,11],[34,3,34,11],[35,3,35,11],[36,3,36,11],[40,3,40,11],[37,3,37,11],[41,3,41,11],[42,3,42,11],[4,3,4,11],[1,0,1,11],[2,0,2,1],[2,3,2,11],[3,3,3,11],[19,3,19,11],[20,3,20,11],[21,3,21,11],[15,3,15,11],[16,3,16,11],[17,3,17,11],[18,3,18,11],[5,3,5,11],[7,3,7,11],[8,3,8,11],[9,3,9,11],[10,3,10,11],[11,3,11,11],[12,3,12,11],[38,3,38,11],[39,3,39,11],[48,3,48,11],[49,3,49,11],[50,3,50,11],[51,3,51,11],[52,3,52,11],[53,3,53,11],[54,3,54,11],[55,3,55,11],[43,3,43,11],[44,3,44,11],[47,3,47,11]]}
["Delta AS Series PLC Selection Tool V2.1",null,null,null,null,null,null,null,null,"Language/語言",null,"ENGLISH",null,null,null,null,null,null,null,null,null,null,null,"AS200_CPU","AS200_CPU","AS200_CPU"]
["Disclaimer: This selection tool is intended to support users in finding the appropriate products and no warranties are made as to its accuracy or reliability. Users should confirm the search result before any purchases are made.",null,null,null,null,null,null,null,null,null,null,null,null,null,null,null,null,null,null,null,null,null,null,"AS228T-A","AS228T-A","AS228T-A"]
["Product Selection",null,null,"Product Features ",null,null,null,null,null,null,null,null,null,null,null,null,null,null,null,null,null,null,null,"AS228P-A","AS228P-A","AS228P-A"]
["CPU Module",null,null,null,null,null,null,null,null,null,null,null,null,null,null,null,null,null,null,null,null,null,null,"AS228R-A","AS228R-A","AS228R-A"]
["Which CPU module series is required?","NONE",null,null,null,null,null,null,null,null,null,null,null,null,null,null,null,null,null,null,null,null,null,"AS218TX-A","AS218TX-A","AS218TX-A"]
[null,null,null,null,null,null,null,null,null,null,null,null,null,null,null,null,null,null,null,null,null,null,null,"AS218PX-A","AS218PX-A","AS218PX-A"]
[null,null,null,null,null,null,null,null,null,null,null,null,null,null,null,null,null,null,null,null,null,null,null,"AS218RX-A","AS218RX-A","AS218RX-A"]
[null,null,null,null,null,null,null,null,null,null,null,null,null,null,null,null,null,null,null,null,null,null,null,"AS300_CPU","AS300_CPU","AS300_CPU"]
[null,null,null,null,null,null,null,null,null,null,null,null,null,null,null,null,null,null,null,null,null,null,null,"AS332T-A","AS332T-A","AS332T-A"]
[null,null,null,null,null,null,null,null,null,null,null,null,null,null,null,null,null,null,null,null,null,null,null,"AS332P-A","AS332P-A","AS332P-A"]
[null,null,null,null,null,null,null,null,null,null,null,null,null,null,null,null,null,null,null,null,null,null,null,"AS324MT-A","AS324MT-A","AS324MT-A"]
[null,null,null,null,null,null,null,null,null,null,null,null,null,null,null,null,null,null,null,null,null,null,null,"AS320T-B","AS320T-B","AS320T-B"]
[null,null,null,null,null,null,null,null,null,null,null,null,null,null,null,null,null,null,null,null,null,null,null,"AS320P-B","AS320P-B","AS320P-B"]
[null,null,null,null,null,null,null,null,null,null,null,null,null,null,null,null,null,null,null,null,null,null,null,"AS300N-A","AS300N-A","AS300N-A"]
[]
[null,null,null,null,null,null,null,null,null,null,null,null,null,null,null,null,null,null,null,null,null,null,null,"Power Module","Power Module","Power Module"]
[null,null,null,null,null,null,null,null,null,null,null,null,null,null,null,null,null,null,null,null,null,null,null,"AS-PS02","AS-PS02","AS-PS02"]
[null,null,null,null,null,null,null,null,null,null,null,null,null,null,null,null,null,null,null,null,null,null,null,"AS-PS02A","AS-PS02A","AS-PS02A"]
[]
[null,null,null,null,null,null,null,null,null,null,null,null,null,null,null,null,null,null,null,null,null,null,null,"Function Card","Function Card","Function Card"]
{"$rows_left_out":46}
{"sheet":"Selection Result","index":1,"n_rows":2,"n_cols":4,"rows_kept":2,"cut":false,"hidden":false,"merged":[[0,0,0,3]]}
["Selection Result"]
["Type","Model Number","Quantity","Description"]

{"sheet":"AS Series Catalogue","index":2,"n_rows":81,"n_cols":24,"rows_kept":81,"cut":false,"hidden":false,"merged":[[80,0,80,3],[80,4,80,5],[80,7,80,8],[80,11,80,15],[77,0,77,26],[78,0,78,3],[78,4,78,5],[78,7,78,8],[78,9,78,10],[78,11,78,15],[79,0,79,3],[79,4,79,5],[79,7,79,8],[79,9,79,10],[79,11,79,15],[59,3,59,4],[59,0,59,2],[59,7,59,11],[57,12,57,14],[58,12,58,14],[59,12,59,14],[69,3,69,4],[69,8,69,11],[69,0,69,2],[69,5,69,7],[65,3,65,4],[66,0,66,2],[66,3,66,4],[58,0,58,2],[58,3,58,4],[58,7,58,11],[61,0,61,26],[62,0,62,2],[62,3,62,4],[62,5,62,7],[62,8,62,11],[68,8,68,11],[65,8,65,11],[66,8,66,11],[45,0,45,2],[45,3,45,4],[45,6,45,7],[45,8,45,9],[45,10,45,11],[45,12,45,16],[46,0,46,2],[46,3,46,4],[46,6,46,7],[46,8,46,9],[46,10,46,11],[5,0,6,2],[7,3,7,4],[7,6,7,7],[7,0,7,2],[8,3,8,4],[8,6,8,7],[9,3,9,4],[9,6,9,7],[10,3,10,4],[10,6,10,7],[8,0,10,2],[49,6,49,7],[49,8,49,9],[49,10,49,11],[49,0,49,2],[48,12,49,16],[11,0,13,2],[11,3,11,4],[11,6,11,7],[12,3,12,4],[12,6,12,7],[13,3,13,4],[13,6,13,7],[40,3,40,4],[40,9,40,10],[41,3,41,4],[41,9,41,10],[40,0,41,2],[36,11,41,15],[47,3,47,4],[47,6,47,7],[47,8,47,9],[47,10,47,11],[46,12,47,16],[47,0,47,2],[17,0,17,2],[17,3,17,4],[17,9,17,10],[17,11,17,12],[17,13,17,17],[2,0,4,2],[2,3,2,4],[2,6,2,7],[0,0,0,26],[1,0,1,2],[1,3,1,4],[1,6,1,7],[1,23,1,28],[3,3,3,4],[3,6,3,7],[4,3,4,4],[4,6,4,7],[16,0,16,26],[5,3,5,4],[5,6,5,7],[6,3,6,4],[6,6,6,7],[2,23,7,28],[8,23,13,28],[18,0,18,2],[18,3,18,4],[18,9,18,10],[18,11,18,12],[18,13,18,17],[19,0,19,2],[19,3,19,4],[19,9,19,10],[19,11,19,12],[19,13,19,17],[20,0,20,2],[20,3,20,4],[20,9,20,10],[20,11,20,12],[20,13,20,17],[21,0,21,2],[21,3,21,4],[21,9,21,10],[21,11,21,12],[21,13,21,17],[22,0,22,2],[22,3,22,4],[22,9,22,10],[22,11,22,12],[22,13,22,17],[23,0,23,2],[23,3,23,4],[23,9,23,10],[23,11,23,12],[23,13,23,17],[24,0,24,2],[24,3,24,4],[24,9,24,10],[24,11,24,12],[24,13,24,17],[25,0,25,2],[25,3,25,4],[25,9,25,10],[25,11,25,12],[25,13,25,17],[26,0,26,2],[26,3,26,4],[26,9,26,10],[26,11,26,12],[26,13,26,17],[27,0,27,2],[27,3,27,4],[27,9,27,10],[27,11,27,12],[27,13,27,17],[28,0,28,2],[28,3,28,4],[28,9,28,10],[28,11,28,12],[28,13,28,17],[29,0,29,2],[29,3,29,4],[29,9,29,10],[29,11,29,12],[29,13,29,17],[36,3,36,4],[36,9,36,10],[30,0,30,2],[30,3,30,4],[30,9,30,10],[30,11,30,12],[30,13,30,17],[31,0,31,2],[31,3,31,4],[31,9,31,10],[31,11,31,12],[31,13,31,17],[32,0,32,2],[32,3,32,4],[32,9,32,10],[32,11,32,12],[32,13,32,17],[34,0,34,26],[35,0,35,2],[35,3,35,4],[35,9,35,10],[35,11,35,15],[36,0,36,2],[37,0,37,2],[37,3,37,4],[37,9,37,10],[38,0,39,2],[38,3,39,4],[38,9,38,10],[39,9,39,10],[56,0,56,26],[57,0,57,2],[57,3,57,4],[57,7,57,11],[54,0,54,2],[54,3,54,4],[54,8,54,9],[54,10,54,14],[48,0,48,2],[48,3,48,4],[48,6,48,7],[48,8,48,9],[48,10,48,11],[53,0,53,2],[53,3,53,4],[53,8,53,9],[53,10,53,14],[73,11,73,15],[74,0,75,3],[74,4,75,5],[74,7,74,8],[74,9,74,10],[74,11,75,15],[75,7,75,8],[75,9,75,10],[73,0,73,3],[73,4,73,5],[73,7,73,8],[73,9,73,10],[44,0,44,16],[52,0,52,16],[67,8,67,11],[63,8,63,11],[64,8,64,11],[71,0,71,26],[72,0,72,3],[72,4,72,5],[72,7,72,8],[72,9,72,10],[72,11,72,15],[63,0,63,2],[63,3,63,4],[63,5,63,7],[64,0,64,2],[64,3,64,4],[67,0,67,2],[67,3,67,4],[67,5,67,7],[68,0,68,2],[68,3,68,4],[68,5,68,7],[65,0,65,2],[49,3,49,4]]}
["CPU MODULE"]
["Product Photo",null,null,"Model Number",null,"Program Capacity(Steps)","Data Register(words)(D,W)",null,"I/O Points","Maximum Extension","Local DI Points","Local DO Points","Micro SD Interface","Funciton Card","Serial Communication Port","Ethernet Port","Output Type","Number of Axis(High Speed Position Input)","Number of Axis(High Speed Position Output)","Basic Instruction Execution(LD) Time","CAN communication port","Analog Input","Analog Output","Dimensions"]
[null,null,null,"AS332T-A",null,"128K","(30000, 30000)",null,1024,32,16,16,"Y",2,2,1,"NPN",6,6,"25ns",0,0,0]
[null,null,null,"AS332P-A",null,"128K","(30000, 30000)",null,1024,32,16,16,"Y",2,2,1,"PNP",6,6,"25ns",0,0,0]
[null,null,null,"AS324MT-A",null,"128K","(30000, 30000)",null,1024,32,12,12,"Y",2,2,1,"Diff.+NPN",6,6,"25ns",0,0,0]
[null,null,null,"AS320T-B",null,"128K","(30000, 30000)",null,1024,32,8,12,"Y",2,2,1,"NPN",4,6,"25ns",0,0,0]
[null,null,null,"AS320P-B",null,"128K","(30000, 30000)",null,1024,32,8,12,"Y",2,2,1,"PNP",4,6,"25ns",0,0,0]
[null,null,null,"AS300N-A",null,"128K","(30000, 30000)",null,1024,32,0,0,"Y",2,2,1,"None",0,0,"25ns",0,0,0]
["圖示",null,null,"AS228T-A",null,"64K","(30000, 30000)",null,1024,32,16,12,"Y",0,2,1,"NPN",4,6,"25ns",1,0,0]
[null,null,null,"AS228P-A",null,"64K","(30000, 30000)",null,1024,32,16,12,"Y",0,2,1,"PNP",4,6,"25ns",1,0,0]
[null,null,null,"AS228R-A",null,"64K","(30000, 30000)",null,1024,32,16,12,"Y",0,2,1,"Relay",4,0,"25ns",1,0,0]
[null,null,null,"AS218TX-A",null,"64K","(30000, 30000)",null,1024,32,8,6,"Y",0,2,1,"NPN",4,3,"25ns",1,2,2]
[null,null,null,"AS218PX-A",null,"64K","(30000, 30000)",null,1024,32,8,6,"Y",0,2,1,"PNP",4,3,"25ns",1,2,2]
[null,null,null,"AS218RX-A",null,"64K","(30000, 30000)",null,1024,32,8,6,"Y",0,2,1,"Relay",4,0,"25ns",1,2,2]
[]
[]
["DIO MODULE"]
["Product Photo",null,null,"Model Number",null,"Type","Input Points","Output Points","Output Type","Input Signal",null,"Terminal Type",null,"Dimensions"]
[null,null,null,"AS08AM10N-A",null,"DI",8,"N/A","N/A","5~24VDC",null,"Spring-clamp"]
[null,null,null,"AS08AN01T-A",null,"DO","N/A",8,"NPN","N/A",null,"Spring-clamp"]
{"$rows_left_out":62}
{"sheet":"Language","index":3,"n_rows":377,"n_cols":4,"rows_kept":377,"cut":false,"hidden":true,"merged":[]}
[null,"繁體中文","ENGLISH","简体中文"]
["參數設定","參數設定","Setting Parameters","参数设定"]
[null,"台達 AS系列 PLC CPU 選型工具 V2.1","Delta AS Series PLC Selection Tool V2.1","台达 AS系列 PLC CPU 选型工具 V2.1"]
[null,"免責聲明: 本工具提供的結果僅提供參考，針對內容的正確性並不負責與保證，使用者在訂購之前仍需進行確認。","Disclaimer: This selection tool is intended to support users in finding the appropriate products and no warranties are made as to its accuracy or reliability. Users should confirm the search result before any purchases are made.","免责声明: 本工具提供的结果仅提供参考，针对内容的正确性并不负责与保证，使用者在订购之前仍需进行确认。"]
[null,"產品選擇","Product Selection","产品选择"]
[null,"產品特色說明","Product Features ","产品特色说明"]
[]
[null,"清除","Clear","清除"]
[null,"執行","Execute","执行"]
[null,"語言","Language","语言"]
[]
[]
[null,"主機","CPU Module","主机"]
[null,"您喜好哪系列的主機？","Which CPU module series is required?","您想要哪系列的主机？"]
[null,"您喜好哪類型的主機？","What type of CPU module is required?","您想要哪类型的主机？"]
[null,"選擇配置功能卡1","Select the Function Card 1","选择配置功能卡1"]
[null,"選擇配置功能卡2","Select the Function Card 2","选择配置功能卡2"]
[null,"主機是否配置線材與配線板？","Do you need suggestions on the accessory selection for the connection of the CPU Modules? ","主机是否自动配置配件？"]
[null,"主機配件-電纜線長度選擇","Cable Length Selections for CPU Modules:"]
[null,"主機配件-電纜線形式選擇","Cable Type Selections for CPU Modules:"]
{"$rows_left_out":358}
{"sheet":"ProductLanguage","index":4,"n_rows":130,"n_cols":4,"rows_kept":130,"cut":false,"hidden":true,"merged":[]}
["機種名稱","產品特色說明-繁中","產品特色說明-英文","產品特色說明-簡中"]
["機種系列"]
["AS200","64K Steps 無內建功能卡，採用彈片型端子座","64K Steps, without function card, spring-clamp terminal block","64K Steps 无内建功能卡，采用弹片型端子座"]
["AS300","128K Steps 內建功能卡，採用高密度(MIC)端子座","128K Steps, with function card, high-density terminal block","128K Steps 内建功能卡，采用高密度(MIC)端子座"]
[]
[]
[]
[]
[]
["AS300"]
["AS332T-A","128K Step, 6軸高速輸出(開集極NPN輸出), 6組高速計數器，內建SD Card、USB與乙太網口","Program capacity:128K steps, 6-axis high speed position output(open-collector NPN outputs), 6 high speed counters, 1x Micro SD interface, 1x USB port, 1x Ethernet port  ","128K Step, 6轴高速输出(开集极NPN输出), 6组高速计数器，内建SD Card、USB与以太网口"]
["AS332P-A","128K Step, 6軸高速輸出(開集極PNP輸出), 6組高速計數器，內建SD Card、USB與乙太網口","Program capacity:128K steps, 6-axis high speed position output(open-collector PNP outputs), 6 high speed counters, 1x Micro SD interface, 1x USB port, 1x Ethernet port  ","128K Step, 6轴高速输出(开集极PNP输出), 6组高速计数器，内建SD Card、USB与以太网口"]
["AS324MT-A","128K Step, 6軸高速輸出(差動輸出2軸+開集極NPN輸出4軸), 6組高速計數器(其中差動輸入2組)，內建SD Card、USB與乙太網口","Program capacity:128K steps, 6-axis high speed position output(2-axis differential output and 4-axis open-collector NPN outputs), 6 high speed counters (including 2x differential inputs), 1x Micro SD interface, 1x USB port, 1x Ethernet port  ","128K Step, 6轴高速输出(差动输出2轴+开集极NPN输出4轴), 6组高速计数器(其中差动输入2组)，内建SD Card、USB与以太网口"]
["AS320T-B","CPU 模組，晶體型（NPN）輸出，內建 Ethernet、RS-485*2、USB 通訊口、Micro SD 卡介面、兩張功能卡（選配）以及 20 點\nIO（8DI+12DO），支援最大 1024 點 I/O，程式容量 128k steps，\n採用脫落式端子","CPU module, NPN output, 1x Ethernet port, 2x RS-485 ports, 1x USB port, 1x Micro SD interface, 2x function cards\n(optional), supporting 20 I/Os (8DI+12DO) and up to 1024 I/Os. Program capacity:128K steps, removable terminal blocks","CPU 模块，晶体型（NPN）输出，内建Ethernet、RS-485*2、USB 通讯口、Micro SD 卡接口、两张功能卡（选配）以及20 点 IO（8DI+12DO），支持最大1024 点I/O，程序容量128k steps，采用脱落式端子"]
["AS320P-B","CPU 模組，晶體型（PNP）輸出，內建 Ethernet、RS-485*2、USB 通訊口、Micro SD 卡介面、兩張功能卡（選配）以及 20 點\nIO（8DI+12DO），支援最大 1024 點 I/O，程式容量 128k steps，\n採用脫落式端子","CPU module, PNP output, 1x Ethernet port , 2x RS-485 ports, 1x USB port, 1x Micro SD interface, 2x function cards\n(optional), supporting 20 I/Os (8DI+12DO) and up to 1024 I/Os. Program capacity:128K steps, removable terminal blocks","CPU 模块，晶体型（PNP）输出，内建Ethernet、RS-485*2、USB 通讯口、Micro SD 卡接口、两张功能卡（选配）以及20 点 IO（8DI+12DO），支持最大1024 点I/O，程序容量128k steps，采用脱落式端子"]
["AS300N-A","CPU 模組，無輸入/輸出點，內建 Ethernet、RS-485*2、USB 通\n訊口、Micro SD 卡介面、兩張功能卡（選配），支援最大 1024\n點 I/O，程式容量 128k steps","CPU module, no I/Os, 1x Ethernet port, 2x RS-485 ports, 1x USB port, 1x Micro SD interface, 2x function cards (optional), and supporting up to 1024 I/Os. Program capacity:128K steps","CPU 模块，无输入/输出点，内建Ethernet、RS-485*2、USB 通讯口、Micro SD 卡接口、两张功能卡（选配），支持最大1024点I/O，程序容量128k steps"]
[]
[]
[]
[]
{"$rows_left_out":111}
{"sheet":"機種清單","index":5,"n_rows":49,"n_cols":12,"rows_kept":49,"cut":false,"hidden":true,"merged":[[36,0,37,0],[38,0,43,0],[44,0,48,0],[0,0,0,3],[2,0,4,0],[5,0,10,0],[11,0,25,0],[26,0,31,0],[33,0,35,0]]}
["AS系列所有機種清單與選型條件清單"]
["模組類別","機種名稱","產品特色說明","DI點數","DO點數","輸出點類型","AI通道數","AO通道數","電纜線","延伸配線板","延伸配線板輸出型式","遠端模組"]
["CPU","AS332T-A",{"$f":"IF('Setting Parameters'!L1=\"ENG\",VLOOKUP(B3:B49,ProLangTable,3,0),VLOOKUP(B3:B49,ProLangTable,2,0))","v":"128K Step, 6軸高速輸出(開集極NPN輸出), 6組高速計數器，內建SD Card、USB與乙太網口"},16,16,"NPN",null,null,1,2]
[null,"AS332P-A",{"$f":"IF('Setting Parameters'!L$1=\"ENG\",VLOOKUP(B$3:B$49,ProLangTable,3,0),VLOOKUP(B$3:B$49,ProLangTable,2,0))","v":"128K Step, 6軸高速輸出(開集極PNP輸出), 6組高速計數器，內建SD Card、USB與乙太網口"},16,16,"PNP",null,null,1,2]
[null,"AS324MT-A",{"$f":"IF('Setting Parameters'!L$1=\"ENG\",VLOOKUP(B$3:B$49,ProLangTable,3,0),VLOOKUP(B$3:B$49,ProLangTable,2,0))","v":"128K Step, 6軸高速輸出(差動輸出2軸+開集極NPN輸出4軸), 6組高速計數器(其中差動輸入2組)，內建SD Card、USB與乙太網口"},12,12,"Diff. + NPN",null,null,1,2]
["Function Card","AS-F232",{"$f":"IF('Setting Parameters'!L$1=\"ENG\",VLOOKUP(B$3:B$49,ProLangTable,3,0),VLOOKUP(B$3:B$49,ProLangTable,2,0))","v":"RS232通訊卡"}]
[null,"AS-F422",{"$f":"IF('Setting Parameters'!L$1=\"ENG\",VLOOKUP(B$3:B$49,ProLangTable,3,0),VLOOKUP(B$3:B$49,ProLangTable,2,0))","v":"RS422通訊卡"}]
[null,"AS-F485",{"$f":"IF('Setting Parameters'!L$1=\"ENG\",VLOOKUP(B$3:B$49,ProLangTable,3,0),VLOOKUP(B$3:B$49,ProLangTable,2,0))","v":"RS485通訊卡"}]
[null,"AS-F2AD",{"$f":"IF('Setting Parameters'!L$1=\"ENG\",VLOOKUP(B$3:B$49,ProLangTable,3,0),VLOOKUP(B$3:B$49,ProLangTable,2,0))","v":"2通道類比輸入卡"}]
[null,"AS-F2DA",{"$f":"IF('Setting Parameters'!L$1=\"ENG\",VLOOKUP(B$3:B$49,ProLangTable,3,0),VLOOKUP(B$3:B$49,ProLangTable,2,0))","v":"2通道類比輸出卡"}]
[null,"AS-FCOPM",{"$f":"IF('Setting Parameters'!L$1=\"ENG\",VLOOKUP(B$3:B$49,ProLangTable,3,0),VLOOKUP(B$3:B$49,ProLangTable,2,0))","v":"CANOpen通訊卡"}]
["DIO","AS08AM10N-A",{"$f":"IF('Setting Parameters'!L$1=\"ENG\",VLOOKUP(B$3:B$49,ProLangTable,3,0),VLOOKUP(B$3:B$49,ProLangTable,2,0))","v":"輸入點模組(8點數位輸入)"},8]
[null,"AS08AN01T-A",{"$f":"IF('Setting Parameters'!L$1=\"ENG\",VLOOKUP(B$3:B$49,ProLangTable,3,0),VLOOKUP(B$3:B$49,ProLangTable,2,0))","v":"輸出點模組(NPN晶體輸出)(8點數位輸出)"},null,8,"NPN"]
[null,"AS08AN01P-A",{"$f":"IF('Setting Parameters'!L$1=\"ENG\",VLOOKUP(B$3:B$49,ProLangTable,3,0),VLOOKUP(B$3:B$49,ProLangTable,2,0))","v":"輸出點模組(PNP晶體輸出)(8點數位輸出)"},null,8,"PNP"]
[null,"AS08AN01R-A",{"$f":"IF('Setting Parameters'!L$1=\"ENG\",VLOOKUP(B$3:B$49,ProLangTable,3,0),VLOOKUP(B$3:B$49,ProLangTable,2,0))","v":"輸出點模組(繼電器輸出)(8點數位輸出)"},null,8,"Relay"]
[null,"AS16AM10N-A",{"$f":"IF('Setting Parameters'!L$1=\"ENG\",VLOOKUP(B$3:B$49,ProLangTable,3,0),VLOOKUP(B$3:B$49,ProLangTable,2,0))","v":"輸入點模組(16點數位輸入)"},16]
[null,"AS16AP11T-A",{"$f":"IF('Setting Parameters'!L$1=\"ENG\",VLOOKUP(B$3:B$49,ProLangTable,3,0),VLOOKUP(B$3:B$49,ProLangTable,2,0))","v":"輸入/輸出點模組(NPN晶體輸出)(8點數位輸出,8點數位輸入)"},8,8,"NPN"]
[null,"AS16AP11P-A",{"$f":"IF('Setting Parameters'!L$1=\"ENG\",VLOOKUP(B$3:B$49,ProLangTable,3,0),VLOOKUP(B$3:B$49,ProLangTable,2,0))","v":"輸入/輸出點模組(PNP晶體輸出)(8點數位輸出,8點數位輸入)"},8,8,"PNP"]
[null,"AS16AP11R-A",{"$f":"IF('Setting Parameters'!L$1=\"ENG\",VLOOKUP(B$3:B$49,ProLangTable,3,0),VLOOKUP(B$3:B$49,ProLangTable,2,0))","v":"輸入/輸出點模組(繼電器輸出)(8點數位輸出,8點數位輸入)"},8,8,"Relay"]
[null,"AS16AN01T-A",{"$f":"IF('Setting Parameters'!L$1=\"ENG\",VLOOKUP(B$3:B$49,ProLangTable,3,0),VLOOKUP(B$3:B$49,ProLangTable,2,0))","v":"輸出點模組(NPN晶體輸出)(16點數位輸出)"},null,16,"NPN"]
{"$rows_left_out":30}
{"sheet":"Language Mapping","index":6,"n_rows":39,"n_cols":3,"rows_kept":39,"cut":false,"hidden":true,"merged":[]}
["ENG","繁中","簡中"]
["Delta AS Series PLC Selection Tool V1.0","台達 AS系列 PLC CPU 選型工具 V1.0","台达 AS300 PLC CPU 选型工具 V1.04"]
["Disclaimer: This selection tool is intended to support users in finding the appropriate products and no warranties are made as to its accuracy or reliability. Users should confirm the search result before any purchases are made.","免責聲明: 本工具提供的結果僅提供參考，針對內容的正確性並不負責與保證，使用者在訂購之前仍需進行確認。","免责声明: 本工具提供的结果仅提供参考，针对内容的正确性并不负责与保证，使用者在订购之前仍需进行确认。"]
["Product Selection","產品選擇","产品选择"]
["CPU Module","主機","主机"]
["Which CPU module series is required?","您喜好哪系列的主機？","您想要哪系列的主机？"]
["What type of CPU module is required?","您喜好哪類型的主機？","您想要哪类型的主机？"]
["Do you need suggestions on the accessory selection for the connection of the CPU and the Module? ","主機與模組是否自動配置配件？","主机与模块是否自动配置配件？"]
["Power Module","電源模組","电源模块"]
["What type of power is required?","您喜好哪類型的電源？","您想要哪类型的电源？"]
["DI/DO Module","數位輸入與輸出模組","数字输入与输出模块"]
["Which combination of the digital I/O points is required? ","您想要優先選擇的輸入輸出點組合？","您想要优先选择的输入输出点组合？"]
["How many digital input points are required?","您總共需要多少數位輸入點？","您总共需要多少数字输入点？"]
["How many digital output points are required? (NPN Type)","您總共需要多少數位輸出點(NPN型)？","您总共需要多少数字输出点(NPN型)？"]
["How many digital output points are required? (PNP Type)","您總共需要多少數位輸出點(PNP型)？","您总共需要多少数字输出点(PNP型)？"]
["How many digital output points are required? (Relay Type)","您總共需要多少數位輸出點(繼電器型)？","您总共需要多少数字输出点(继电器型)？"]
["How many I/O points are required on one module?","您接受多少點的模組？","您接受多少点的模块？"]
["AI/AO Module","類比輸入與輸出模組","模拟输入与输出模块"]
["Which combination of the analog I/O points is required? ","您想要優先選擇的類比輸入輸出組合？","您想要优先选择的模拟输入输出组合？"]
["How many channels are required for one analog input module?","您總共需要多少通道的類比輸入模組？","您总共需要多少通道的模拟输入模块？"]
{"$rows_left_out":19}